Wed Feb 13 00:41:33 PST 2008
- Previous message: [Slony1-general] Re: compilation : cannot find -lpgport
- Next message: [Slony1-general] Slony1 rollbacks and 8.3.x
- Messages sorted by: [ date ] [ thread ] [ subject ] [ author ]
OK. My mistake. Bug 159382 <https://bugzilla.redhat.com/bugzilla/show_bug.cgi?id=3D159382>= is not compromised. I made a few tests aroud and the configuration/compilation steps are succesful for the following version of slony : slony1-1.1.9 slony1-1.2.0 slony1-1.2.12 Not for slony1-1.2.13. Regression? My understanding? Hope this info will be useful. Anyway, I'm thankful for what i've got. Cheers, 2008/2/12, lio bod <liobod.slony at gmail.com>: > > is it in relation with Bug 159382 (For RHEL) > <https://bugzilla.redhat.com/bugzilla/show_bug.cgi?id=3D159382>? > https://bugzilla.redhat.com/show_bug.cgi?id=3D159382 > > > Dave Botsch said : > > 'Stuff such as slony can't be built on rhel4 due to this issue. Please fi= x in RHEL4.' > > Is it true? > > Any known workaround? > > > > > 2008/2/12, lio bod <liobod.slony at gmail.com>: > > > > Hello world, > > > > For the first time of my life i'm trying to compile slony and i'm facing > > an issue i haven't seen in mailing list archive... > > > > The step ./configure --with-pgconfigdir=3D$PGMAIN/bin is ok. > > > > On gmake all, i've got an error message telling : '/usr/bin/ld: cannot > > find -lpgport' > > > > My env is : > > > > gcc 3.4.3 20041212 (Red Hat 3.4.3-9.EL4) > > slony1-1.2.13 > > postgresql - v7.4.19 (installed rpms are postgresql-libs, postgresql , > > postgresql-server, postgresql-devel) > > Red Hat Enterprise Linux ES release 4 (Nahant) 2.6.9-5 > > > > Any hint is welcome, > > > > lio > > > > ----- > > > > Here's the end of gmake output (sorry it's french) : > > > > .../... > > scan.c:2310: attention : =C2=AB yy_flex_realloc =C2=BB d=C3(c)fini mais= n'a pas > > =C3(c)t=C3(c) utilis=C3(c) > > gcc -g -O2 -Wall -Wmissing-prototypes -Wmissing-declarations -I../.. > > -DPGSHARE=3D"\"/usr/share/pgsql/\"" slonik.o dbutil.o parser.o > > ../parsestatements/scanner.o -L/usr/lib/ -L/usr/lib/pgsql/ -lpq > > -Wl,-rpath,/usr/lib/ -lpgport -o slonik > > /usr/bin/ld: ne peut trouver -lpgport > > collect2: ld a retourn=C3(c) 1 code d'=C3(c)tat d'ex=C3(c)cution > > gmake[2]: *** [slonik] Erreur 1 > > gmake[2]: Leaving directory `/home/postgresql/slony1-1.2.13/src/slonik' > > gmake[1]: *** [all] Erreur 2 > > gmake[1]: Leaving directory `/home/postgresql/slony1-1.2.13/src' > > gmake: *** [all] Erreur 2 > > > > > > > > -------------- next part -------------- An HTML attachment was scrubbed... URL: http://lists.slony.info/pipermail/slony1-general/attachments/20080213/= 45e9f4cb/attachment.htm
- Previous message: [Slony1-general] Re: compilation : cannot find -lpgport
- Next message: [Slony1-general] Slony1 rollbacks and 8.3.x
- Messages sorted by: [ date ] [ thread ] [ subject ] [ author ]
More information about the Slony1-general mailing list